1.6.0-rc2 is our Nth official release of VTK-m.

The major changes to VTK-m from (previous release) can be found in:
  docs/changelog/1.6/release-notes.md

Signed-off-by: Vicente Adolfo Bolea Sanchez <vicente.bolea@kitware.com>
33 jobs for !2497 with update-to-v1.6.0-rc2 in 31 minutes and 3 seconds (queued for 7 seconds)
detached
Status Name Job ID Coverage
  Build
passed build:centos7_gcc73 #5820108
linux docker build vtkm cuda-rt large-memory

00:06:00

passed build:centos8_sanitizer #5820004
build vtkm docker linux

00:09:32

passed build:rhel8 #5820005
build vtkm docker linux

00:05:30

passed build:rhel8_vtk_types #5820006
build vtkm docker linux

00:03:57

passed build:ubuntu1604_clang5 #5820008
build vtkm docker linux

00:08:07

passed build:ubuntu1604_gcc5 #5820007
build vtkm docker linux cuda-rt large-memory

00:06:35

passed build:ubuntu1804_clang8 #5820013
build vtkm docker linux

00:05:55

failed build:ubuntu1804_clang_cuda #5820011
build vtkm docker linux cuda-rt large-memory

00:00:33

passed build:ubuntu1804_gcc6 #5820012
build vtkm docker linux

00:00:42

failed build:ubuntu1804_gcc7 #5820010
build vtkm docker linux cuda-rt large-memory

00:00:34

passed build:ubuntu1804_gcc9 #5820009
build vtkm docker linux

00:05:17

failed build:ubuntu1804_kokkos #5820014
build vtkm docker linux cuda-rt large-memory

00:00:32

passed build:ubuntu2004_kokkos #5820015
build vtkm docker linux

00:05:29

passed build:windows_vs2019 #5820016
vtkm nonconcurrent build windows shell vs2019 msvc-19.25 large-memory

00:06:57

failed build:centos7_gcc73 #5820003
build vtkm docker linux cuda-rt large-memory

00:02:13

 
  Test
passed test:centos7_gcc73 #5820017
test vtkm docker linux cuda-rt turing

00:06:55

failed test:centos8_sanitizer #5820019
test vtkm docker linux privileged

passed test:rhel8 #5820020
test vtkm docker linux

00:00:34

passed test:rhel8_test_centos7 #5820018
test vtkm docker linux cuda-rt turing

00:06:53

passed test:rhel8_vtk_types #5820021
test vtkm docker linux

00:00:47

passed test:ubuntu1604_clang5 #5820023
test vtkm docker linux

00:03:15

passed test:ubuntu1604_gcc5 #5820022
test vtkm docker linux cuda-rt pascal

00:02:47

failed test:ubuntu1804_clang8 #5820028
test vtkm docker linux

00:12:10

skipped test:ubuntu1804_clang_cuda #5820026
test vtkm docker linux cuda-rt pascal
passed test:ubuntu1804_gcc6 #5820027
test vtkm docker linux

00:00:57

skipped test:ubuntu1804_gcc7 #5820025
test vtkm docker linux cuda-rt turing
passed test:ubuntu1804_gcc9 #5820024
test vtkm docker linux

00:03:00

skipped test:ubuntu1804_kokkos #5820029
test vtkm docker linux cuda-rt turing
passed test:ubuntu2004_kokkos #5820030
test vtkm docker linux

00:01:05

passed test:windows_vs2019 #5820031
vtkm nonconcurrent test windows shell vs2019 msvc-19.25 cuda-rt turing

00:00:24

 
  External
passed vtk-m-dragnipur-osx-shared-debug+32bit_ids+64bit_coords+clang+tbb

00:12:36

passed vtk-m-dragnipur-osx-static-release+64bit_coords+clang+tbb

00:00:19

passed vtk-m-osheim-windows-static-release+ninja-vs-2017+tbb

00:02:21

 
Name Stage Failure
failed
test:ubuntu1804_clang8 Test

Uploading artifacts for failed job
Uploading artifacts...
build/*.png: found 14 matching files and directories

WARNING: build/*.pnm: no matching files
WARNING: build/*.pmm: no matching files
Uploading artifacts as "archive" to coordinator... ok
id=5820028 responseStatus=201 Created token=fb1wKG5Z
Cleaning up file based variables
ERROR: Job failed: exit code 1
failed
test:centos8_sanitizer Test There has been a timeout failure or the job got stuck. Check your timeout limits or try again
No job log
failed
build:ubuntu1804_kokkos Build There has been a runner system failure, please try again
WARNING: build/*/*/*.cmake: no matching files      
WARNING: build/*/*/*/*.cmake: no matching files
WARNING: build/*/*/*/*/*.cmake: no matching files
WARNING: build/*/*/*/*/*/*.cmake: no matching files
WARNING: build/Testing/: no matching files
WARNING: build/DartConfiguration.tcl: no matching files
ERROR: No files to upload
Cleaning up file based variables
ERROR: Job failed (system failure): Error response from daemon: OCI runtime create failed: container_linux.go:367: starting container process caused: process_linux.go:495: container init caused: Running hook #1:: error running hook: exit status 1, stdout: , stderr: nvidia-container-cli: initialization error: nvml error: driver/library version mismatch: unknown (exec.go:57:3s)
failed
build:ubuntu1804_clang_cuda Build There has been a runner system failure, please try again
WARNING: build/*/*/*.cmake: no matching files      
WARNING: build/*/*/*/*.cmake: no matching files
WARNING: build/*/*/*/*/*.cmake: no matching files
WARNING: build/*/*/*/*/*/*.cmake: no matching files
WARNING: build/Testing/: no matching files
WARNING: build/DartConfiguration.tcl: no matching files
ERROR: No files to upload
Cleaning up file based variables
ERROR: Job failed (system failure): Error response from daemon: OCI runtime create failed: container_linux.go:367: starting container process caused: process_linux.go:495: container init caused: Running hook #1:: error running hook: exit status 1, stdout: , stderr: nvidia-container-cli: initialization error: nvml error: driver/library version mismatch: unknown (exec.go:57:3s)
failed
build:ubuntu1804_gcc7 Build There has been a runner system failure, please try again
WARNING: build/*/*/*.cmake: no matching files      
WARNING: build/*/*/*/*.cmake: no matching files
WARNING: build/*/*/*/*/*.cmake: no matching files
WARNING: build/*/*/*/*/*/*.cmake: no matching files
WARNING: build/Testing/: no matching files
WARNING: build/DartConfiguration.tcl: no matching files
ERROR: No files to upload
Cleaning up file based variables
ERROR: Job failed (system failure): Error response from daemon: OCI runtime create failed: container_linux.go:367: starting container process caused: process_linux.go:495: container init caused: Running hook #1:: error running hook: exit status 1, stdout: , stderr: nvidia-container-cli: initialization error: nvml error: driver/library version mismatch: unknown (exec.go:57:3s)