Bump cache versions to fix tests

20 jobs for dev/0.2.15 in 4 minutes and 35 seconds (queued for 7 seconds)
Status Name Job ID Coverage
  Build
passed build/cp36-cp36m-linux #6276841
docker linux build

00:00:07

passed build/cp37-cp37-linux #6276840
docker linux build

00:00:07

passed build/cp38-cp38-linux #6276839
docker linux build

00:00:17

passed build/cp39-cp39-linux #6276838
docker linux build

00:00:17

 
  Test
failed test_full_loose/cp36-cp36m-linux #6276854
docker linux build

00:01:57

65.0%
failed test_full_loose/cp37-cp37-linux #6276850
docker linux build

00:01:36

65.0%
failed test_full_loose/cp38-cp38-linux #6276846
docker linux build

00:03:18

65.0%
failed test_full_loose/cp39-cp39-linux #6276842
docker linux build

00:03:56

65.0%
failed test_full_strict/cp36-cp36m-linux #6276856
docker linux build

00:03:18

65.0%
failed test_full_strict/cp37-cp37-linux #6276852
docker linux build

00:01:35

65.0%
failed test_full_strict/cp38-cp38-linux #6276848
docker linux build

00:02:01

65.0%
failed test_full_strict/cp39-cp39-linux #6276844
docker linux build

00:04:13

65.0%
failed test_minimal_loose/cp36-cp36m-linux #6276855
docker linux build

00:03:08

59.0%
failed test_minimal_loose/cp37-cp37-linux #6276851
docker linux build

00:02:47

59.0%
failed test_minimal_loose/cp38-cp38-linux #6276847
docker linux build

00:03:06

60.0%
failed test_minimal_loose/cp39-cp39-linux #6276843
docker linux build

00:03:36

60.0%
failed test_minimal_strict/cp36-cp36m-linux #6276857
docker linux build

00:01:54

59.0%
failed test_minimal_strict/cp37-cp37-linux #6276853
docker linux build

00:02:52

59.0%
failed test_minimal_strict/cp38-cp38-linux #6276849
docker linux build

00:03:04

60.0%
failed test_minimal_strict/cp39-cp39-linux #6276845
docker linux build

00:02:57

60.0%
 
Name Stage Failure
failed
test_full_strict/cp39-cp39-linux Test
FAILED kwcoco/util/util_delayed_poc.py::__doc__:1
FAILED kwcoco/util/util_delayed_poc.py::DelayedChannelConcat.take_channels:0
FAILED kwcoco/util/util_delayed_poc.py::DelayedChannelConcat.take_channels:1
FAILED kwcoco/util/util_delayed_poc.py::DelayedChannelConcat.take_channels:2
FAILED tests/test_multispectral.py::test_multispectral_union_absolute - Value...
FAILED tests/test_multispectral.py::test_multispectral_union_relative - Value...
====== 30 failed, 266 passed, 26 skipped, 7 warnings in 144.02s (0:02:24) ======
Cleaning up file based variables
ERROR: Job failed: exit code 1
failed
test_full_loose/cp39-cp39-linux Test
FAILED kwcoco/util/util_delayed_poc.py::DelayedChannelConcat.take_channels:0
FAILED kwcoco/util/util_delayed_poc.py::DelayedChannelConcat.take_channels:1
FAILED kwcoco/util/util_delayed_poc.py::DelayedChannelConcat.take_channels:2
FAILED tests/test_multispectral.py::test_multispectral_name_to_img_index - Va...
FAILED tests/test_multispectral.py::test_multispectral_union_absolute - Value...
FAILED tests/test_multispectral.py::test_multispectral_union_relative - Value...
====== 30 failed, 266 passed, 26 skipped, 4 warnings in 136.81s (0:02:16) ======
Cleaning up file based variables
ERROR: Job failed: exit code 1
failed
test_minimal_loose/cp39-cp39-linux Test
FAILED kwcoco/util/util_delayed_poc.py::__doc__:1
FAILED kwcoco/util/util_delayed_poc.py::DelayedChannelConcat.take_channels:0
FAILED kwcoco/util/util_delayed_poc.py::DelayedChannelConcat.take_channels:1
FAILED kwcoco/util/util_delayed_poc.py::DelayedChannelConcat.take_channels:2
FAILED tests/test_multispectral.py::test_multispectral_union_absolute - Value...
FAILED tests/test_multispectral.py::test_multispectral_union_relative - Value...
====== 26 failed, 245 passed, 51 skipped, 3 warnings in 121.74s (0:02:01) ======
Cleaning up file based variables
ERROR: Job failed: exit code 1
failed
test_full_loose/cp38-cp38-linux Test
FAILED kwcoco/util/util_delayed_poc.py::__doc__:1
FAILED kwcoco/util/util_delayed_poc.py::DelayedChannelConcat.take_channels:0
FAILED kwcoco/util/util_delayed_poc.py::DelayedChannelConcat.take_channels:1
FAILED kwcoco/util/util_delayed_poc.py::DelayedChannelConcat.take_channels:2
FAILED tests/test_multispectral.py::test_multispectral_union_absolute - Value...
FAILED tests/test_multispectral.py::test_multispectral_union_relative - Value...
====== 28 failed, 268 passed, 26 skipped, 3 warnings in 92.11s (0:01:32) =======
Cleaning up file based variables
ERROR: Job failed: exit code 1
failed
test_full_strict/cp36-cp36m-linux Test
FAILED kwcoco/util/util_delayed_poc.py::__doc__:1
FAILED kwcoco/util/util_delayed_poc.py::DelayedChannelConcat.take_channels:0
FAILED kwcoco/util/util_delayed_poc.py::DelayedChannelConcat.take_channels:1
FAILED kwcoco/util/util_delayed_poc.py::DelayedChannelConcat.take_channels:2
FAILED tests/test_multispectral.py::test_multispectral_union_absolute - Value...
FAILED tests/test_multispectral.py::test_multispectral_union_relative - Value...
===== 30 failed, 266 passed, 26 skipped, 10 warnings in 109.04s (0:01:49) ======
Cleaning up file based variables
ERROR: Job failed: exit code 1
failed
test_minimal_loose/cp38-cp38-linux Test
FAILED kwcoco/util/util_delayed_poc.py::__doc__:1
FAILED kwcoco/util/util_delayed_poc.py::DelayedChannelConcat.take_channels:0
FAILED kwcoco/util/util_delayed_poc.py::DelayedChannelConcat.take_channels:1
FAILED kwcoco/util/util_delayed_poc.py::DelayedChannelConcat.take_channels:2
FAILED tests/test_multispectral.py::test_multispectral_union_absolute - Value...
FAILED tests/test_multispectral.py::test_multispectral_union_relative - Value...
====== 27 failed, 244 passed, 51 skipped, 2 warnings in 112.63s (0:01:52) ======
Cleaning up file based variables
ERROR: Job failed: exit code 1
failed
test_minimal_strict/cp38-cp38-linux Test
FAILED kwcoco/util/util_delayed_poc.py::__doc__:1
FAILED kwcoco/util/util_delayed_poc.py::DelayedChannelConcat.take_channels:0
FAILED kwcoco/util/util_delayed_poc.py::DelayedChannelConcat.take_channels:1
FAILED kwcoco/util/util_delayed_poc.py::DelayedChannelConcat.take_channels:2
FAILED tests/test_multispectral.py::test_multispectral_union_absolute - Value...
FAILED tests/test_multispectral.py::test_multispectral_union_relative - Value...
====== 27 failed, 244 passed, 51 skipped, 5 warnings in 114.20s (0:01:54) ======
Cleaning up file based variables
ERROR: Job failed: exit code 1
failed
test_minimal_loose/cp36-cp36m-linux Test
FAILED kwcoco/util/util_delayed_poc.py::__doc__:1
FAILED kwcoco/util/util_delayed_poc.py::DelayedChannelConcat.take_channels:0
FAILED kwcoco/util/util_delayed_poc.py::DelayedChannelConcat.take_channels:1
FAILED kwcoco/util/util_delayed_poc.py::DelayedChannelConcat.take_channels:2
FAILED tests/test_multispectral.py::test_multispectral_union_absolute - Value...
FAILED tests/test_multispectral.py::test_multispectral_union_relative - Value...
====== 25 failed, 246 passed, 51 skipped, 2 warnings in 116.08s (0:01:56) ======
Cleaning up file based variables
ERROR: Job failed: exit code 1
failed
test_minimal_strict/cp39-cp39-linux Test
FAILED kwcoco/util/util_delayed_poc.py::__doc__:1
FAILED kwcoco/util/util_delayed_poc.py::DelayedChannelConcat.take_channels:0
FAILED kwcoco/util/util_delayed_poc.py::DelayedChannelConcat.take_channels:1
FAILED kwcoco/util/util_delayed_poc.py::DelayedChannelConcat.take_channels:2
FAILED tests/test_multispectral.py::test_multispectral_union_absolute - Value...
FAILED tests/test_multispectral.py::test_multispectral_union_relative - Value...
====== 28 failed, 243 passed, 51 skipped, 5 warnings in 80.76s (0:01:20) =======
Cleaning up file based variables
ERROR: Job failed: exit code 1
failed
test_minimal_strict/cp37-cp37-linux Test
FAILED kwcoco/util/util_delayed_poc.py::__doc__:1
FAILED kwcoco/util/util_delayed_poc.py::DelayedChannelConcat.take_channels:0
FAILED kwcoco/util/util_delayed_poc.py::DelayedChannelConcat.take_channels:1
FAILED kwcoco/util/util_delayed_poc.py::DelayedChannelConcat.take_channels:2
FAILED tests/test_multispectral.py::test_multispectral_union_absolute - Value...
FAILED tests/test_multispectral.py::test_multispectral_union_relative - Value...
====== 27 failed, 244 passed, 51 skipped, 3 warnings in 89.72s (0:01:29) =======
Cleaning up file based variables
ERROR: Job failed: exit code 1
failed
test_minimal_loose/cp37-cp37-linux Test
FAILED kwcoco/util/util_delayed_poc.py::__doc__:1
FAILED kwcoco/util/util_delayed_poc.py::DelayedChannelConcat.take_channels:0
FAILED kwcoco/util/util_delayed_poc.py::DelayedChannelConcat.take_channels:1
FAILED kwcoco/util/util_delayed_poc.py::DelayedChannelConcat.take_channels:2
FAILED tests/test_multispectral.py::test_multispectral_union_absolute - Value...
FAILED tests/test_multispectral.py::test_multispectral_union_relative - Value...
====== 27 failed, 244 passed, 51 skipped, 3 warnings in 85.34s (0:01:25) =======
Cleaning up file based variables
ERROR: Job failed: exit code 1
failed
test_full_strict/cp38-cp38-linux Test
FAILED kwcoco/util/util_delayed_poc.py::__doc__:1
FAILED kwcoco/util/util_delayed_poc.py::DelayedChannelConcat.take_channels:0
FAILED kwcoco/util/util_delayed_poc.py::DelayedChannelConcat.take_channels:1
FAILED kwcoco/util/util_delayed_poc.py::DelayedChannelConcat.take_channels:2
FAILED tests/test_multispectral.py::test_multispectral_union_absolute - Value...
FAILED tests/test_multispectral.py::test_multispectral_union_relative - Value...
====== 28 failed, 268 passed, 26 skipped, 5 warnings in 75.22s (0:01:15) =======
Cleaning up file based variables
ERROR: Job failed: exit code 1
failed
test_full_loose/cp36-cp36m-linux Test
FAILED kwcoco/util/util_delayed_poc.py::__doc__:1
FAILED kwcoco/util/util_delayed_poc.py::DelayedChannelConcat.take_channels:0
FAILED kwcoco/util/util_delayed_poc.py::DelayedChannelConcat.take_channels:1
FAILED kwcoco/util/util_delayed_poc.py::DelayedChannelConcat.take_channels:2
FAILED tests/test_multispectral.py::test_multispectral_union_absolute - Value...
FAILED tests/test_multispectral.py::test_multispectral_union_relative - Value...
====== 29 failed, 267 passed, 26 skipped, 4 warnings in 71.08s (0:01:11) =======
Cleaning up file based variables
ERROR: Job failed: exit code 1
failed
test_minimal_strict/cp36-cp36m-linux Test
FAILED kwcoco/util/util_delayed_poc.py::DelayedChannelConcat.take_channels:0
FAILED kwcoco/util/util_delayed_poc.py::DelayedChannelConcat.take_channels:1
FAILED kwcoco/util/util_delayed_poc.py::DelayedChannelConcat.take_channels:2
FAILED tests/test_multispectral.py::test_multispectral_name_to_img_index - Va...
FAILED tests/test_multispectral.py::test_multispectral_union_absolute - Value...
FAILED tests/test_multispectral.py::test_multispectral_union_relative - Value...
====== 29 failed, 242 passed, 51 skipped, 7 warnings in 62.86s (0:01:02) =======
Cleaning up file based variables
ERROR: Job failed: exit code 1
failed
test_full_loose/cp37-cp37-linux Test
FAILED kwcoco/util/util_delayed_poc.py::__doc__:1
FAILED kwcoco/util/util_delayed_poc.py::DelayedChannelConcat.take_channels:0
FAILED kwcoco/util/util_delayed_poc.py::DelayedChannelConcat.take_channels:1
FAILED kwcoco/util/util_delayed_poc.py::DelayedChannelConcat.take_channels:2
FAILED tests/test_multispectral.py::test_multispectral_union_absolute - Value...
FAILED tests/test_multispectral.py::test_multispectral_union_relative - Value...
=========== 29 failed, 267 passed, 26 skipped, 3 warnings in 51.74s ============
Cleaning up file based variables
ERROR: Job failed: exit code 1
failed
test_full_strict/cp37-cp37-linux Test
FAILED kwcoco/util/util_delayed_poc.py::__doc__:1
FAILED kwcoco/util/util_delayed_poc.py::DelayedChannelConcat.take_channels:0
FAILED kwcoco/util/util_delayed_poc.py::DelayedChannelConcat.take_channels:1
FAILED kwcoco/util/util_delayed_poc.py::DelayedChannelConcat.take_channels:2
FAILED tests/test_multispectral.py::test_multispectral_union_absolute - Value...
FAILED tests/test_multispectral.py::test_multispectral_union_relative - Value...
=========== 28 failed, 268 passed, 26 skipped, 5 warnings in 54.02s ============
Cleaning up file based variables
ERROR: Job failed: exit code 1