remove debug print

20 jobs for dev/0.2.14 in 4 minutes and 34 seconds (queued for 10 seconds)
Status Name Job ID Coverage
  Build
passed build/cp36-cp36m-linux #6264167
docker linux build

00:00:28

passed build/cp37-cp37-linux #6264166
docker linux build

00:00:46

passed build/cp38-cp38-linux #6264165
docker linux build

00:00:14

passed build/cp39-cp39-linux #6264164
docker linux build

00:00:19

 
  Test
failed test_full_loose/cp36-cp36m-linux #6264180
docker linux build

00:02:18

67.0%
failed test_full_loose/cp37-cp37-linux #6264176
docker linux build

00:03:15

67.0%
failed test_full_loose/cp38-cp38-linux #6264172
docker linux build

00:02:21

67.0%
failed test_full_loose/cp39-cp39-linux #6264168
docker linux build

00:03:46

67.0%
failed test_full_strict/cp36-cp36m-linux #6264182
docker linux build

00:03:40

67.0%
failed test_full_strict/cp37-cp37-linux #6264178
docker linux build

00:03:43

67.0%
failed test_full_strict/cp38-cp38-linux #6264174
docker linux build

00:02:18

67.0%
failed test_full_strict/cp39-cp39-linux #6264170
docker linux build

00:02:23

67.0%
failed test_minimal_loose/cp36-cp36m-linux #6264181
docker linux build

00:02:07

61.0%
failed test_minimal_loose/cp37-cp37-linux #6264177
docker linux build

00:02:34

61.0%
failed test_minimal_loose/cp38-cp38-linux #6264173
docker linux build

00:02:09

61.0%
failed test_minimal_loose/cp39-cp39-linux #6264169
docker linux build

00:02:11

61.0%
failed test_minimal_strict/cp36-cp36m-linux #6264183
docker linux build

00:02:08

61.0%
failed test_minimal_strict/cp37-cp37-linux #6264179
docker linux build

00:02:34

61.0%
failed test_minimal_strict/cp38-cp38-linux #6264175
docker linux build

00:03:29

61.0%
failed test_minimal_strict/cp39-cp39-linux #6264171
docker linux build

00:02:14

61.0%
 
Name Stage Failure
failed
test_full_strict/cp37-cp37-linux Test
---------------------------------------------------------------------------------------
TOTAL 10707 3266 3831 437 67%
Coverage HTML written to dir htmlcov

=========================== short test summary info ============================
FAILED kwcoco/util/util_archive.py::Archive:0
====== 1 failed, 285 passed, 25 skipped, 7 warnings in 143.91s (0:02:23) =======
Cleaning up file based variables
ERROR: Job failed: exit code 1
failed
test_full_strict/cp36-cp36m-linux Test
---------------------------------------------------------------------------------------
TOTAL 10707 3267 3831 437 67%
Coverage HTML written to dir htmlcov

=========================== short test summary info ============================
FAILED kwcoco/util/util_archive.py::Archive:0
====== 1 failed, 285 passed, 25 skipped, 14 warnings in 139.73s (0:02:19) ======
Cleaning up file based variables
ERROR: Job failed: exit code 1
failed
test_full_loose/cp37-cp37-linux Test
---------------------------------------------------------------------------------------
TOTAL 10707 3265 3831 438 67%
Coverage HTML written to dir htmlcov

=========================== short test summary info ============================
FAILED kwcoco/util/util_archive.py::Archive:0
====== 1 failed, 285 passed, 25 skipped, 2 warnings in 114.13s (0:01:54) =======
Cleaning up file based variables
ERROR: Job failed: exit code 1
failed
test_full_loose/cp39-cp39-linux Test
---------------------------------------------------------------------------------------
TOTAL 10860 3266 3831 440 67%
Coverage HTML written to dir htmlcov

=========================== short test summary info ============================
FAILED kwcoco/util/util_archive.py::Archive:0
====== 1 failed, 285 passed, 25 skipped, 2 warnings in 149.26s (0:02:29) =======
Cleaning up file based variables
ERROR: Job failed: exit code 1
failed
test_minimal_strict/cp38-cp38-linux Test
---------------------------------------------------------------------------------------
TOTAL 10860 3970 3831 399 61%
Coverage HTML written to dir htmlcov

=========================== short test summary info ============================
FAILED kwcoco/util/util_archive.py::Archive:0
====== 1 failed, 260 passed, 50 skipped, 5 warnings in 133.19s (0:02:13) =======
Cleaning up file based variables
ERROR: Job failed: exit code 1
failed
test_minimal_strict/cp37-cp37-linux Test
---------------------------------------------------------------------------------------
TOTAL 10707 3968 3831 398 61%
Coverage HTML written to dir htmlcov

=========================== short test summary info ============================
FAILED kwcoco/util/util_archive.py::Archive:0
======= 1 failed, 260 passed, 50 skipped, 5 warnings in 78.65s (0:01:18) =======
Cleaning up file based variables
ERROR: Job failed: exit code 1
failed
test_minimal_loose/cp37-cp37-linux Test
---------------------------------------------------------------------------------------
TOTAL 10707 3969 3831 398 61%
Coverage HTML written to dir htmlcov

=========================== short test summary info ============================
FAILED kwcoco/util/util_archive.py::Archive:0
======= 1 failed, 260 passed, 50 skipped, 1 warning in 90.61s (0:01:30) ========
Cleaning up file based variables
ERROR: Job failed: exit code 1
failed
test_full_loose/cp36-cp36m-linux Test
---------------------------------------------------------------------------------------
TOTAL 10707 3265 3831 438 67%
Coverage HTML written to dir htmlcov

=========================== short test summary info ============================
FAILED kwcoco/util/util_archive.py::Archive:0
======= 1 failed, 285 passed, 25 skipped, 6 warnings in 86.35s (0:01:26) =======
Cleaning up file based variables
ERROR: Job failed: exit code 1
failed
test_minimal_strict/cp36-cp36m-linux Test
---------------------------------------------------------------------------------------
TOTAL 10707 3969 3831 398 61%
Coverage HTML written to dir htmlcov

=========================== short test summary info ============================
FAILED kwcoco/util/util_archive.py::Archive:0
====== 1 failed, 260 passed, 50 skipped, 10 warnings in 78.01s (0:01:18) =======
Cleaning up file based variables
ERROR: Job failed: exit code 1
failed
test_full_strict/cp39-cp39-linux Test
---------------------------------------------------------------------------------------
TOTAL 10860 3267 3831 439 67%
Coverage HTML written to dir htmlcov

=========================== short test summary info ============================
FAILED kwcoco/util/util_archive.py::Archive:0
======= 1 failed, 285 passed, 25 skipped, 7 warnings in 86.06s (0:01:26) =======
Cleaning up file based variables
ERROR: Job failed: exit code 1
failed
test_minimal_loose/cp36-cp36m-linux Test
---------------------------------------------------------------------------------------
TOTAL 10707 3969 3831 398 61%
Coverage HTML written to dir htmlcov

=========================== short test summary info ============================
FAILED kwcoco/util/util_archive.py::Archive:0
======= 1 failed, 260 passed, 50 skipped, 4 warnings in 75.38s (0:01:15) =======
Cleaning up file based variables
ERROR: Job failed: exit code 1
failed
test_full_loose/cp38-cp38-linux Test
---------------------------------------------------------------------------------------
TOTAL 10860 3266 3831 440 67%
Coverage HTML written to dir htmlcov

=========================== short test summary info ============================
FAILED kwcoco/util/util_archive.py::Archive:0
======= 1 failed, 285 passed, 25 skipped, 2 warnings in 85.35s (0:01:25) =======
Cleaning up file based variables
ERROR: Job failed: exit code 1
failed
test_full_strict/cp38-cp38-linux Test
---------------------------------------------------------------------------------------
TOTAL 10860 3267 3831 439 67%
Coverage HTML written to dir htmlcov

=========================== short test summary info ============================
FAILED kwcoco/util/util_archive.py::Archive:0
======= 1 failed, 285 passed, 25 skipped, 7 warnings in 85.21s (0:01:25) =======
Cleaning up file based variables
ERROR: Job failed: exit code 1
failed
test_minimal_strict/cp39-cp39-linux Test
---------------------------------------------------------------------------------------
TOTAL 10860 3970 3831 399 61%
Coverage HTML written to dir htmlcov

=========================== short test summary info ============================
FAILED kwcoco/util/util_archive.py::Archive:0
======= 1 failed, 260 passed, 50 skipped, 5 warnings in 77.96s (0:01:17) =======
Cleaning up file based variables
ERROR: Job failed: exit code 1
failed
test_minimal_loose/cp39-cp39-linux Test
---------------------------------------------------------------------------------------
TOTAL 10860 3971 3831 399 61%
Coverage HTML written to dir htmlcov

=========================== short test summary info ============================
FAILED kwcoco/util/util_archive.py::Archive:0
======= 1 failed, 260 passed, 50 skipped, 1 warning in 75.14s (0:01:15) ========
Cleaning up file based variables
ERROR: Job failed: exit code 1
failed
test_minimal_loose/cp38-cp38-linux Test
---------------------------------------------------------------------------------------
TOTAL 10860 3971 3831 399 61%
Coverage HTML written to dir htmlcov

=========================== short test summary info ============================
FAILED kwcoco/util/util_archive.py::Archive:0
======= 1 failed, 260 passed, 50 skipped, 1 warning in 74.12s (0:01:14) ========
Cleaning up file based variables
ERROR: Job failed: exit code 1