Merge topic 'macos11-support'

fbd23ad9 ci: update cmake to 3.19.4
b5e499a7 cmake: add a warning about packaging on macOS 11 and old CMake
9f6b0526 superbuild: bump for macOS 11 packaging support

Acked-by: Kitware Robot <kwrobot@kitware.com>
Acked-by: David Thompson <david.thompson@kitware.com>
Merge-request: !721
43 jobs for master
Status Name Job ID Coverage
  Build
passed build:centos7-aeva #5515152
docker linux build cmb delayed

00:15:13

passed build:centos7-modelbuilder #5515117
cmb docker linux build delayed

00:27:51

failed build:centos7-newparaview #5515133
docker linux build cmb allowed to fail delayed

01:01:02

passed build:centos7-vtk #5515124
build cmb docker linux delayed

00:17:18

passed build:centos7-vtk-python2 #5515128
build cmb docker linux delayed

00:22:24

passed build:macos-aeva #5515154
cmb macos shell xcode-11.5 nonconcurrent delayed

00:54:56

passed build:macos-modelbuilder #5515139
cmb macos shell xcode-11.5 nonconcurrent delayed

00:20:19

passed build:macos-smtk #5515142
cmb macos shell xcode-11.5 nonconcurrent delayed

00:20:16

passed build:windows-vs2019-aeva #5515156
cmb msvc-19.26 nonconcurrent shell vs2019 windows delayed

01:05:34

passed build:windows-vs2019-modelbuilder #5515147
cmb msvc-19.26 nonconcurrent shell vs2019 windows delayed

00:54:15

passed build:windows-vs2019-smtk #5515149
cmb msvc-19.26 nonconcurrent shell vs2019 windows delayed

00:53:31

 
  Test
passed test:centos7-aeva #5515177
cmb docker linux x11

00:03:16

passed test:centos7-modelbuilder #5515158
cmb docker linux x11

00:03:03

failed test:centos7-newparaview #5515164
cmb docker linux x11 allowed to fail

00:00:17

passed test:centos7-vtk #5515160
cmb docker linux x11

00:01:08

passed test:centos7-vtk-python2 #5515162
cmb docker linux x11

00:00:54

passed test:macos-aeva #5515179
shell xcode-11.5 nonconcurrent cmb macos

00:10:50

passed test:macos-modelbuilder #5515165
cmb macos shell xcode-11.5 nonconcurrent

00:02:52

passed test:macos-smtk #5515167
cmb macos shell xcode-11.5 nonconcurrent

00:01:33

failed test:windows-vs2019-aeva #5515181
cmb msvc-19.26 nonconcurrent shell vs2019 windows

00:06:04

failed test:windows-vs2019-modelbuilder #5515169
cmb msvc-19.26 nonconcurrent shell vs2019 windows

00:08:15

failed test:windows-vs2019-smtk #5515173
cmb msvc-19.26 nonconcurrent shell vs2019 windows

00:03:06

 
  Upload
passed upload:girder-linux-aeva #5515190
docker linux build

00:00:26

passed upload:girder-linux-modelbuilder #5515183
docker linux build

00:00:15

failed upload:girder-macos-aeva #5515192
docker linux build

00:00:55

passed upload:girder-macos-modelbuilder #5515186
docker linux build

00:00:48

skipped upload:girder-windows-vs2019-aeva #5515194
docker linux build
skipped upload:girder-windows-vs2019-modelbuilder #5515188
docker linux build
 
  Update Ci
failed update-ci:aeva-fedora32 #5515213
cmb docker linux privileged

00:16:03

passed update-ci:aeva-macos #5515215
docker linux build

00:01:09

skipped update-ci:aeva-windows-vs2019 #5515217
docker linux build
failed update-ci:aevasession-fedora32 #5515212
cmb docker linux privileged

00:11:47

passed update-ci:aevasession-macos #5515214
docker linux build

00:01:28

skipped update-ci:aevasession-windows-vs2019 #5515216
docker linux build
failed update-ci:cmb-fedora31 #5515207
cmb docker linux privileged

00:34:22

passed update-ci:cmb-macos #5515209
docker linux build

00:01:40

skipped update-ci:cmb-windows-vs2019 #5515211
docker linux build
passed update-ci:smtk-fedora31 #5515196
cmb docker linux privileged

00:07:36

failed update-ci:smtk-fedora31-paraview #5515197
cmb docker linux privileged

00:09:41

passed update-ci:smtk-fedora31-vtk #5515199
cmb docker linux privileged

00:12:52

passed update-ci:smtk-fedora31-vtk-python2 #5515201
privileged cmb docker linux

00:15:20

passed update-ci:smtk-macos #5515203
docker linux build

00:02:13

skipped update-ci:smtk-windows-vs2019 #5515205
docker linux build
 
Name Stage Failure
failed
update-ci:aeva-fedora32 Update Ci
+ cmake -GNinja -DDEVELOPER_MODE_aeva:BOOL=ON -DENABLE_aeva:BOOL=ON -DENABLE_python3:BOOL=ON -DSUPPRESS_szip_OUTPUT:BOOL=OFF -DUSE_SYSTEM_qt5:BOOL=ON -DCMAKE_C_COMPILER_LAUNCHER=/root/helpers/sccache -DCMAKE_CXX_COMPILER_LAUNCHER=/root/helpers/sccache -D__BUILDBOT_INSTALL_LOCATION:PATH=/root/misc/root/smtk-deps /builds/gitlab-kitware-sciviz-ci
+ ninja
Error: error building at STEP "RUN sh /root/install_superbuild.sh "$superbuild_ref"": error while running runtime: exit status 1
Uploading artifacts for failed job
Uploading artifacts...
build.log: found 1 matching files and directories

Uploading artifacts as "archive" to coordinator... ok
id=5515213 responseStatus=201 Created token=CAkS6QAW
Cleaning up file based variables
ERROR: Job failed: exit code 1
failed
update-ci:aevasession-fedora32 Update Ci
+ cmake -GNinja -DDEVELOPER_MODE_aevasession:BOOL=ON -DDEVELOPER_MODE_aeva:BOOL=ON -DENABLE_aeva:BOOL=ON -DENABLE_python3:BOOL=ON -DSUPPRESS_szip_OUTPUT:BOOL=OFF -DUSE_SYSTEM_qt5:BOOL=ON -DCMAKE_C_COMPILER_LAUNCHER=/root/helpers/sccache -DCMAKE_CXX_COMPILER_LAUNCHER=/root/helpers/sccache -D__BUILDBOT_INSTALL_LOCATION:PATH=/root/misc/root/smtk-deps /builds/gitlab-kitware-sciviz-ci
+ ninja
Error: error building at STEP "RUN sh /root/install_superbuild.sh "$superbuild_ref"": error while running runtime: exit status 1
Uploading artifacts for failed job
Uploading artifacts...
build.log: found 1 matching files and directories

Uploading artifacts as "archive" to coordinator... ok
id=5515212 responseStatus=201 Created token=6TKbXS-Y
Cleaning up file based variables
ERROR: Job failed: exit code 1
failed
update-ci:smtk-fedora31-paraview Update Ci

+ ninja
Error: error building at STEP "RUN sh /root/install_superbuild.sh "$superbuild_ref"": error while running runtime: exit status 1
Uploading artifacts for failed job
Uploading artifacts...
build.log: found 1 matching files and directories

Uploading artifacts as "archive" to coordinator... ok
id=5515197 responseStatus=201 Created token=THnzhoq5
Cleaning up file based variables
ERROR: Job failed: exit code 1
failed
upload:girder-macos-aeva Upload
<head><title>502 Bad Gateway</title></head>
<body bgcolor="white">
<center><h1>502 Bad Gateway</h1></center>
<hr><center>nginx/1.14.0 (Ubuntu)</center>
</body>
</html>

Cleaning up file based variables
ERROR: Job failed: exit code 1
failed
test:windows-vs2019-aeva Test
WARNING: build/aeva*.tar.*: no matching files      
WARNING: build/modelbuilder-*.tar.*: no matching files
WARNING: build/aeva*.dmg: no matching files
WARNING: build/modelbuilder-*.dmg: no matching files
build/aeva*.zip: found 1 matching files and directories

WARNING: build/modelbuilder-*.zip: no matching files
WARNING: Failed to load system CertPool: crypto/x509: system root pool is not available on Windows
Uploading artifacts as "archive" to coordinator... ok
id=5515181 responseStatus=201 Created token=idv2j2nz
ERROR: Job failed: exit status 1
failed
test:windows-vs2019-smtk Test
   Submission successful
CMake Error at C:/glr/builds/cmb/cmb-ci/.gitlab/ci/ctest_test.cmake:76 (message):
Failed to test


Running after_script
Running after script...
$ cmd /C "rmdir /S /Q build\superbuild\smtk\build\PluginTests"
ERROR: Job failed: exit status 1
failed
test:windows-vs2019-modelbuilder Test
WARNING: build/aeva*.tar.*: no matching files      
WARNING: build/modelbuilder-*.tar.*: no matching files
WARNING: build/aeva*.dmg: no matching files
WARNING: build/modelbuilder-*.dmg: no matching files
WARNING: build/aeva*.zip: no matching files
build/modelbuilder-*.zip: found 1 matching files and directories

WARNING: Failed to load system CertPool: crypto/x509: system root pool is not available on Windows
Uploading artifacts as "archive" to coordinator... ok
id=5515169 responseStatus=201 Created token=aXfdtJyC
ERROR: Job failed: exit status 1
failed
test:centos7-newparaview Test
WARNING: build/aeva*.tar.*: no matching files      
WARNING: build/modelbuilder-*.tar.*: no matching files
WARNING: build/aeva*.dmg: no matching files
WARNING: build/modelbuilder-*.dmg: no matching files
WARNING: build/aeva*.zip: no matching files
WARNING: build/modelbuilder-*.zip: no matching files
ERROR: No files to upload
Cleaning up file based variables
ERROR: Job failed: exit code 1
failed
build:centos7-newparaview Build The script exceeded the maximum execution time set for the job
build/cpack/: found 5 matching files and directories 
build/CTestCustom*.cmake: found 2 matching files and directories

build/CTestTestfile.cmake: found 1 matching files and directories

build/superbuild/CTestTestfile.cmake: found 1 matching files and directories

build/Testing/: found 13 matching files and directories

build/DartConfiguration.tcl: found 1 matching files and directories

build/*-developer-config.cmake: found 2 matching files and directories

build/superbuild/*/build/install_manifest.txt: found 18 matching files and directories

ERROR: Job failed: execution took longer than 1h0m0s seconds
failed
update-ci:cmb-fedora31 Update Ci
+ ninja
Error: error building at STEP "RUN sh /root/install_superbuild.sh "$superbuild_ref"": error while running runtime: exit status 1
Uploading artifacts for failed job
Uploading artifacts...
build.log: found 1 matching files and directories

Uploading artifacts as "archive" to coordinator... ok
id=5515207 responseStatus=201 Created token=2tCG5-zv
Cleaning up file based variables
ERROR: Failed to cleanup volumes
ERROR: Job failed: exit code 1