Merge topic 'sb-fixes'

eb545ffa ci: use a Python2-compatible numpy for the python2 build
a9c3569a superbuild: bump for python2 compatibility
28bed403 cmake: include CTest at the top-level
28c8be70 cmake: include the Cython project (for NumPy)

Acked-by: Kitware Robot <kwrobot@kitware.com>
Acked-by: Aron Helser <aron.helser@kitware.com>
Merge-request: !720
43 jobs for master
Status Name Job ID Coverage
  Build
passed build:centos7-aeva #5481608
build cmb docker linux delayed

00:18:17

passed build:centos7-modelbuilder #5481576
build cmb docker linux delayed

00:29:14

failed build:centos7-newparaview #5481590
build cmb docker linux allowed to fail delayed

00:13:07

passed build:centos7-vtk #5481582
build cmb docker linux delayed

00:23:58

passed build:centos7-vtk-python2 #5481585
build cmb docker linux delayed

00:20:17

passed build:macos-aeva #5481610
cmb macos shell xcode-11.5 nonconcurrent delayed

00:38:02

passed build:macos-modelbuilder #5481595
cmb macos shell xcode-11.5 nonconcurrent delayed

00:20:08

failed build:macos-smtk #5481599
cmb macos shell xcode-11.5 nonconcurrent delayed

00:08:01

passed build:windows-vs2019-aeva #5481612
cmb msvc-19.26 nonconcurrent shell vs2019 windows delayed

01:06:37

passed build:windows-vs2019-modelbuilder #5481601
windows cmb msvc-19.26 nonconcurrent shell vs2019 delayed

00:54:58

passed build:windows-vs2019-smtk #5481605
cmb msvc-19.26 nonconcurrent shell vs2019 windows delayed

00:54:14

 
  Test
passed test:centos7-aeva #5481629
cmb docker linux x11

00:03:12

passed test:centos7-modelbuilder #5481614
cmb docker linux x11

00:03:21

failed test:centos7-newparaview #5481620
cmb docker linux x11 allowed to fail

00:00:42

passed test:centos7-vtk #5481616
cmb docker linux x11

00:01:19

passed test:centos7-vtk-python2 #5481618
cmb docker linux x11

00:01:00

failed test:macos-aeva #5481632
cmb macos shell xcode-11.5 nonconcurrent

00:01:23

failed test:macos-modelbuilder #5481621
cmb macos shell xcode-11.5 nonconcurrent

00:01:54

skipped test:macos-smtk #5481623
shell xcode-11.5 nonconcurrent cmb macos
failed test:windows-vs2019-aeva #5481635
cmb msvc-19.26 nonconcurrent shell vs2019 windows

00:06:57

failed test:windows-vs2019-modelbuilder #5481625
cmb msvc-19.26 nonconcurrent shell vs2019 windows

00:08:25

failed test:windows-vs2019-smtk #5481628
cmb msvc-19.26 nonconcurrent shell vs2019 windows

00:04:03

 
  Upload
passed upload:girder-linux-aeva #5481644
docker linux build

00:00:42

passed upload:girder-linux-modelbuilder #5481638
docker linux build

00:00:14

skipped upload:girder-macos-aeva #5481645
docker linux build
skipped upload:girder-macos-modelbuilder #5481640
docker linux build
skipped upload:girder-windows-vs2019-aeva #5481647
docker linux build
skipped upload:girder-windows-vs2019-modelbuilder #5481642
docker linux build
 
  Update Ci
failed update-ci:aeva-fedora32 #5481669
cmb docker linux privileged

00:12:07

skipped update-ci:aeva-macos #5481672
docker linux build
skipped update-ci:aeva-windows-vs2019 #5481674
docker linux build
failed update-ci:aevasession-fedora32 #5481667
cmb docker linux privileged

00:11:52

skipped update-ci:aevasession-macos #5481671
linux build docker
skipped update-ci:aevasession-windows-vs2019 #5481673
docker linux build
failed update-ci:cmb-fedora31 #5481660
cmb docker linux privileged

00:13:36

skipped update-ci:cmb-macos #5481663
docker linux build
skipped update-ci:cmb-windows-vs2019 #5481665
docker linux build
passed update-ci:smtk-fedora31 #5481649
cmb docker linux privileged

00:07:57

failed update-ci:smtk-fedora31-paraview #5481651
cmb docker linux privileged

00:09:53

passed update-ci:smtk-fedora31-vtk #5481653
cmb docker linux privileged

00:18:57

passed update-ci:smtk-fedora31-vtk-python2 #5481655
cmb docker linux privileged

00:12:14

skipped update-ci:smtk-macos #5481657
docker linux build
skipped update-ci:smtk-windows-vs2019 #5481659
docker linux build
 
Name Stage Failure
failed
update-ci:aeva-fedora32 Update Ci
+ cmake -GNinja -DDEVELOPER_MODE_aeva:BOOL=ON -DENABLE_aeva:BOOL=ON -DENABLE_python3:BOOL=ON -DSUPPRESS_szip_OUTPUT:BOOL=OFF -DUSE_SYSTEM_qt5:BOOL=ON -DCMAKE_C_COMPILER_LAUNCHER=/root/helpers/sccache -DCMAKE_CXX_COMPILER_LAUNCHER=/root/helpers/sccache -D__BUILDBOT_INSTALL_LOCATION:PATH=/root/misc/root/smtk-deps /builds/gitlab-kitware-sciviz-ci
+ ninja
Error: error building at STEP "RUN sh /root/install_superbuild.sh "$superbuild_ref"": error while running runtime: exit status 1
Uploading artifacts for failed job
Uploading artifacts...
build.log: found 1 matching files and directories

Uploading artifacts as "archive" to coordinator... ok
id=5481669 responseStatus=201 Created token=6dpFRMKq
Cleaning up file based variables
ERROR: Job failed: exit code 1
failed
update-ci:aevasession-fedora32 Update Ci
+ cmake -GNinja -DDEVELOPER_MODE_aevasession:BOOL=ON -DDEVELOPER_MODE_aeva:BOOL=ON -DENABLE_aeva:BOOL=ON -DENABLE_python3:BOOL=ON -DSUPPRESS_szip_OUTPUT:BOOL=OFF -DUSE_SYSTEM_qt5:BOOL=ON -DCMAKE_C_COMPILER_LAUNCHER=/root/helpers/sccache -DCMAKE_CXX_COMPILER_LAUNCHER=/root/helpers/sccache -D__BUILDBOT_INSTALL_LOCATION:PATH=/root/misc/root/smtk-deps /builds/gitlab-kitware-sciviz-ci
+ ninja
Error: error building at STEP "RUN sh /root/install_superbuild.sh "$superbuild_ref"": error while running runtime: exit status 1
Uploading artifacts for failed job
Uploading artifacts...
build.log: found 1 matching files and directories

Uploading artifacts as "archive" to coordinator... ok
id=5481667 responseStatus=201 Created token=qx7wmozA
Cleaning up file based variables
ERROR: Job failed: exit code 1
failed
test:windows-vs2019-aeva Test
WARNING: build/aeva*.tar.*: no matching files      
WARNING: build/modelbuilder-*.tar.*: no matching files
WARNING: build/aeva*.dmg: no matching files
WARNING: build/modelbuilder-*.dmg: no matching files
build/aeva*.zip: found 1 matching files and directories

WARNING: build/modelbuilder-*.zip: no matching files
WARNING: Failed to load system CertPool: crypto/x509: system root pool is not available on Windows
Uploading artifacts as "archive" to coordinator... ok
id=5481635 responseStatus=201 Created token=w2MQ5AMY
ERROR: Job failed: exit status 1
failed
test:windows-vs2019-smtk Test
   Submission successful
CMake Error at C:/glr/builds/cmb/cmb-ci/.gitlab/ci/ctest_test.cmake:75 (message):
Failed to test


Running after_script
Running after script...
$ cmd /C "rmdir /S /Q build\superbuild\smtk\build\PluginTests"
ERROR: Job failed: exit status 1
failed
test:windows-vs2019-modelbuilder Test
WARNING: build/aeva*.tar.*: no matching files      
WARNING: build/modelbuilder-*.tar.*: no matching files
WARNING: build/aeva*.dmg: no matching files
WARNING: build/modelbuilder-*.dmg: no matching files
WARNING: build/aeva*.zip: no matching files
build/modelbuilder-*.zip: found 1 matching files and directories

WARNING: Failed to load system CertPool: crypto/x509: system root pool is not available on Windows
Uploading artifacts as "archive" to coordinator... ok
id=5481625 responseStatus=201 Created token=HY359KAq
ERROR: Job failed: exit status 1
failed
build:macos-smtk Build
   Upload file: /opt/glr/cmb/cmb-ci/build/Testing/20210121-0502/Notes.xml to https://open.cdash.org/submit.php?project=CMB&FileName=gitlab-ci___cmb-superbuild-macos_smtk___20210121-0502-master-packages___XML___Notes.xml&build=cmb-superbuild-macos_smtk&site=gitlab-ci&stamp=20210121-0502-master-packages&MD5=e7aad220d0ea400e61c749c3a5b2a9ee Size: 667188
Uploaded: /opt/glr/cmb/cmb-ci/build/Testing/20210121-0502/Notes.xml
Submission successful
CMake Error at /opt/glr/cmb/cmb-ci/.gitlab/ci/ctest_build.cmake:22 (message):
Failed to build


Cleaning up file based variables
ERROR: Job failed: exit status 1
failed
build:centos7-newparaview Build
   Upload file: /builds/gitlab-kitware-sciviz-ci/build/Testing/20210121-0508/Notes.xml to https://open.cdash.org/submit.php?project=CMB&FileName=gitlab-ci___cmb-superbuild-centos7_newparaview___20210121-0508-master-packages___XML___Notes.xml&build=cmb-superbuild-centos7_newparaview&site=gitlab-ci&stamp=20210121-0508-master-packages&MD5=74377923490a6a73ec4129f2e3728057 Size: 38760969
Uploaded: /builds/gitlab-kitware-sciviz-ci/build/Testing/20210121-0508/Notes.xml
Submission successful
CMake Error at /builds/gitlab-kitware-sciviz-ci/.gitlab/ci/ctest_build.cmake:22 (message):
Failed to build


Cleaning up file based variables
ERROR: Job failed: exit code 1
failed
test:macos-aeva Test
WARNING: build/aeva*.tar.*: no matching files      
WARNING: build/modelbuilder-*.tar.*: no matching files
WARNING: build/aeva*.dmg: no matching files
WARNING: build/modelbuilder-*.dmg: no matching files
WARNING: build/aeva*.zip: no matching files
WARNING: build/modelbuilder-*.zip: no matching files
ERROR: No files to upload
Cleaning up file based variables
ERROR: Job failed: exit status 1
failed
test:centos7-newparaview Test
WARNING: build/modelbuilder-*.tar.*: no matching files 
WARNING: build/aeva*.dmg: no matching files
WARNING: build/modelbuilder-*.dmg: no matching files
WARNING: build/aeva*.zip: no matching files
WARNING: build/modelbuilder-*.zip: no matching files
ERROR: No files to upload
Cleaning up file based variables
ERROR: Failed to cleanup volumes
ERROR: Job failed: exit code 1
failed
update-ci:cmb-fedora31 Update Ci
+ cmake -GNinja -DDEVELOPER_MODE_cmb:BOOL=ON -DENABLE_cmb:BOOL=ON -DENABLE_cmbusersguide:BOOL=OFF -DENABLE_python3:BOOL=ON -DSUPPRESS_szip_OUTPUT:BOOL=OFF -DUSE_SYSTEM_qt5:BOOL=ON -DCMAKE_C_COMPILER_LAUNCHER=/root/helpers/sccache -DCMAKE_CXX_COMPILER_LAUNCHER=/root/helpers/sccache -D__BUILDBOT_INSTALL_LOCATION:PATH=/root/misc/root/smtk-deps /builds/gitlab-kitware-sciviz-ci
+ ninja
Error: error building at STEP "RUN sh /root/install_superbuild.sh "$superbuild_ref"": error while running runtime: exit status 1
Uploading artifacts for failed job
Uploading artifacts...
build.log: found 1 matching files and directories

Uploading artifacts as "archive" to coordinator... ok
id=5481660 responseStatus=201 Created token=43G6fJSS
Cleaning up file based variables
ERROR: Job failed: exit code 1
failed
update-ci:smtk-fedora31-paraview Update Ci

+ ninja
Error: error building at STEP "RUN sh /root/install_superbuild.sh "$superbuild_ref"": error while running runtime: exit status 1
Uploading artifacts for failed job
Uploading artifacts...
build.log: found 1 matching files and directories

Uploading artifacts as "archive" to coordinator... ok
id=5481651 responseStatus=201 Created token=c1CipTJo
Cleaning up file based variables
ERROR: Job failed: exit code 1
failed
test:macos-modelbuilder Test
WARNING: build/aeva*.tar.*: no matching files      
WARNING: build/modelbuilder-*.tar.*: no matching files
WARNING: build/aeva*.dmg: no matching files
WARNING: build/modelbuilder-*.dmg: no matching files
WARNING: build/aeva*.zip: no matching files
WARNING: build/modelbuilder-*.zip: no matching files
ERROR: No files to upload
Cleaning up file based variables
ERROR: Job failed: exit status 1