Merge topic 'macos-empty-deployment-target'

56dc8d6e superbuild: bump for Python3 builds with an empty deployment target

Acked-by: Kitware Robot <kwrobot@kitware.com>
Acked-by: Bob Obara <bob.obara@kitware.com>
Merge-request: !719
43 jobs for master
Status Name Job ID Coverage
  Build
passed build:centos7-aeva #5479125
build cmb docker linux delayed

00:15:00

failed build:centos7-modelbuilder #5479084
cmb docker linux build delayed

01:01:47

passed build:centos7-newparaview #5479102
build cmb docker linux delayed

00:38:27

failed build:centos7-vtk #5479091
build cmb docker linux delayed

00:00:43

failed build:centos7-vtk-python2 #5479098
build cmb docker linux delayed

00:00:13

passed build:macos-aeva #5479128
cmb macos shell xcode-11.5 nonconcurrent delayed

00:24:04

passed build:macos-modelbuilder #5479108
cmb macos shell xcode-11.5 nonconcurrent delayed

00:20:18

failed build:macos-smtk #5479112
cmb macos shell xcode-11.5 nonconcurrent delayed

00:37:04

passed build:windows-vs2019-aeva #5479131
cmb msvc-19.26 nonconcurrent shell vs2019 windows delayed

01:06:35

passed build:windows-vs2019-modelbuilder #5479116
cmb msvc-19.26 nonconcurrent shell vs2019 windows delayed

00:55:10

passed build:windows-vs2019-smtk #5479122
cmb msvc-19.26 nonconcurrent shell vs2019 windows delayed

00:54:28

 
  Test
passed test:centos7-aeva #5479149
cmb docker linux x11

00:03:59

skipped test:centos7-modelbuilder #5479133
cmb docker linux x11
passed test:centos7-newparaview #5479139
cmb docker linux x11

00:04:50

skipped test:centos7-vtk #5479135
cmb docker linux x11
skipped test:centos7-vtk-python2 #5479137
cmb docker linux x11
failed test:macos-aeva #5479150
cmb macos shell xcode-11.5 nonconcurrent

00:01:36

passed test:macos-modelbuilder #5479140
cmb macos shell xcode-11.5 nonconcurrent

00:10:57

skipped test:macos-smtk #5479142
cmb macos shell xcode-11.5 nonconcurrent
failed test:windows-vs2019-aeva #5479152
cmb msvc-19.26 nonconcurrent shell vs2019 windows

00:06:54

failed test:windows-vs2019-modelbuilder #5479144
cmb msvc-19.26 nonconcurrent shell vs2019 windows

00:08:46

failed test:windows-vs2019-smtk #5479146
cmb msvc-19.26 nonconcurrent shell vs2019 windows

00:03:44

 
  Upload
passed upload:girder-linux-aeva #5479164
docker linux build

00:00:32

skipped upload:girder-linux-modelbuilder #5479156
docker linux build
skipped upload:girder-macos-aeva #5479167
build docker linux
passed upload:girder-macos-modelbuilder #5479159
docker linux build

00:00:22

skipped upload:girder-windows-vs2019-aeva #5479169
docker linux build
skipped upload:girder-windows-vs2019-modelbuilder #5479162
docker linux build
 
  Update Ci
failed update-ci:aeva-fedora32 #5479190
cmb docker linux privileged

00:09:01

skipped update-ci:aeva-macos #5479194
docker linux build
skipped update-ci:aeva-windows-vs2019 #5479198
docker linux build
failed update-ci:aevasession-fedora32 #5479188
cmb docker linux privileged

00:39:16

skipped update-ci:aevasession-macos #5479192
docker linux build
skipped update-ci:aevasession-windows-vs2019 #5479196
docker linux build
skipped update-ci:cmb-fedora31 #5479183
cmb docker linux privileged
passed update-ci:cmb-macos #5479184
docker linux build

00:01:18

skipped update-ci:cmb-windows-vs2019 #5479186
docker linux build
skipped update-ci:smtk-fedora31 #5479171
cmb docker linux privileged
skipped update-ci:smtk-fedora31-paraview #5479173
cmb docker linux privileged
skipped update-ci:smtk-fedora31-vtk #5479175
cmb docker linux privileged
skipped update-ci:smtk-fedora31-vtk-python2 #5479177
cmb docker linux privileged
skipped update-ci:smtk-macos #5479179
docker linux build
skipped update-ci:smtk-windows-vs2019 #5479181
docker linux build
 
Name Stage Failure
failed
update-ci:aeva-fedora32 Update Ci
+ cmake -GNinja -DDEVELOPER_MODE_aeva:BOOL=ON -DENABLE_aeva:BOOL=ON -DENABLE_python3:BOOL=ON -DSUPPRESS_szip_OUTPUT:BOOL=OFF -DUSE_SYSTEM_qt5:BOOL=ON -DCMAKE_C_COMPILER_LAUNCHER=/root/helpers/sccache -DCMAKE_CXX_COMPILER_LAUNCHER=/root/helpers/sccache -D__BUILDBOT_INSTALL_LOCATION:PATH=/root/misc/root/smtk-deps /builds/gitlab-kitware-sciviz-ci
+ ninja
Error: error building at STEP "RUN sh /root/install_superbuild.sh "$superbuild_ref"": error while running runtime: exit status 1
Uploading artifacts for failed job
Uploading artifacts...
build.log: found 1 matching files and directories

Uploading artifacts as "archive" to coordinator... ok
id=5479190 responseStatus=201 Created token=Ah2Aaz1C
Cleaning up file based variables
ERROR: Job failed: exit code 1
failed
test:windows-vs2019-aeva Test
WARNING: build/aeva*.tar.*: no matching files      
WARNING: build/modelbuilder-*.tar.*: no matching files
WARNING: build/aeva*.dmg: no matching files
WARNING: build/modelbuilder-*.dmg: no matching files
build/aeva*.zip: found 1 matching files and directories

WARNING: build/modelbuilder-*.zip: no matching files
WARNING: Failed to load system CertPool: crypto/x509: system root pool is not available on Windows
Uploading artifacts as "archive" to coordinator... ok
id=5479152 responseStatus=201 Created token=VvUHyf56
ERROR: Job failed: exit status 1
failed
test:windows-vs2019-smtk Test
   Submission successful
CMake Error at C:/glr/builds/cmb/cmb-ci/.gitlab/ci/ctest_test.cmake:75 (message):
Failed to test


Running after_script
Running after script...
$ cmd /C "rmdir /S /Q build\superbuild\smtk\build\PluginTests"
ERROR: Job failed: exit status 1
failed
test:windows-vs2019-modelbuilder Test
WARNING: build/aeva*.tar.*: no matching files      
WARNING: build/modelbuilder-*.tar.*: no matching files
WARNING: build/aeva*.dmg: no matching files
WARNING: build/modelbuilder-*.dmg: no matching files
WARNING: build/aeva*.zip: no matching files
build/modelbuilder-*.zip: found 1 matching files and directories

WARNING: Failed to load system CertPool: crypto/x509: system root pool is not available on Windows
Uploading artifacts as "archive" to coordinator... ok
id=5479144 responseStatus=201 Created token=ZA4zAf37
ERROR: Job failed: exit status 1
failed
build:macos-smtk Build
build/superbuild/*/build/install_manifest.txt: found 14 matching files and directories 
ERROR: Uploading artifacts as "archive" to coordinator... error error=couldn't execute POST against https://gitlab.kitware.com/api/v4/jobs/5479112/artifacts?artifact_format=zip&artifact_type=archive&expire_in=1d: Post https://gitlab.kitware.com/api/v4/jobs/5479112/artifacts?artifact_format=zip&artifact_type=archive&expire_in=1d: write tcp 10.171.3.150:61479->192.168.115.123:443: write: broken pipe id=5479112 token=6UEaGBUY
WARNING: Retrying... context=artifacts-uploader error=invalid argument
ERROR: Uploading artifacts as "archive" to coordinator... error error=couldn't execute POST against https://gitlab.kitware.com/api/v4/jobs/5479112/artifacts?artifact_format=zip&artifact_type=archive&expire_in=1d: Post https://gitlab.kitware.com/api/v4/jobs/5479112/artifacts?artifact_format=zip&artifact_type=archive&expire_in=1d: dial tcp 192.168.115.123:443: i/o timeout id=5479112 token=6UEaGBUY
WARNING: Retrying... context=artifacts-uploader error=invalid argument
ERROR: Uploading artifacts as "archive" to coordinator... error error=couldn't execute POST against https://gitlab.kitware.com/api/v4/jobs/5479112/artifacts?artifact_format=zip&artifact_type=archive&expire_in=1d: Post https://gitlab.kitware.com/api/v4/jobs/5479112/artifacts?artifact_format=zip&artifact_type=archive&expire_in=1d: dial tcp 192.168.115.123:443: i/o timeout id=5479112 token=6UEaGBUY
FATAL: invalid argument
Cleaning up file based variables
ERROR: Job failed: exit status 1
failed
build:centos7-vtk-python2 Build
   Error when uploading file: /builds/gitlab-kitware-sciviz-ci/build/Testing/20210120-0452/Configure.xml
Error message was: The requested URL returned error: 419 unknown status
Problems when submitting via HTTP
CMake Error at /builds/gitlab-kitware-sciviz-ci/.gitlab/ci/ctest_configure.cmake:28 (message):
Failed to configure


Cleaning up file based variables
ERROR: Job failed: exit code 1
failed
build:centos7-vtk Build
   Error when uploading file: /builds/gitlab-kitware-sciviz-ci/build/Testing/20210120-0454/Configure.xml
Error message was: The requested URL returned error: 419 unknown status
Problems when submitting via HTTP
CMake Error at /builds/gitlab-kitware-sciviz-ci/.gitlab/ci/ctest_configure.cmake:28 (message):
Failed to configure


Cleaning up file based variables
ERROR: Job failed: exit code 1
failed
build:centos7-modelbuilder Build The script exceeded the maximum execution time set for the job
-- Configuring done
-- Generating done
-- Build files have been written to: /builds/gitlab-kitware-sciviz-ci/build/superbuild/paraview/build
[299/324] Performing build step for 'paraview'
-- paraview build command succeeded. See also /builds/gitlab-kitware-sciviz-ci/build/superbuild/paraview/stamp/paraview-build-*.log
[300/324] Performing install step for 'paraview'
-- paraview install command succeeded. See also /builds/gitlab-kitware-sciviz-ci/build/superbuild/paraview/stamp/paraview-install-*.log
[301/324] Completed 'paraview'
ERROR: Job failed: execution took longer than 1h0m0s seconds
failed
update-ci:aevasession-fedora32 Update Ci
+ ninja
Error: error building at STEP "RUN sh /root/install_superbuild.sh "$superbuild_ref"": error while running runtime: exit status 1
Uploading artifacts for failed job
Uploading artifacts...
build.log: found 1 matching files and directories

Uploading artifacts as "archive" to coordinator... ok
id=5479188 responseStatus=201 Created token=uHftgLFb
Cleaning up file based variables
ERROR: Failed to cleanup volumes
ERROR: Job failed: exit code 1
failed
test:macos-aeva Test
WARNING: build/aeva*.tar.*: no matching files      
WARNING: build/modelbuilder-*.tar.*: no matching files
WARNING: build/aeva*.dmg: no matching files
WARNING: build/modelbuilder-*.dmg: no matching files
WARNING: build/aeva*.zip: no matching files
WARNING: build/modelbuilder-*.zip: no matching files
ERROR: No files to upload
Cleaning up file based variables
ERROR: Job failed: exit status 1